BDBM83312 4-Chloro-N-[2-(1H-indol-3-yl)-ethyl]-N-(8-methyl-8-aza-bicyclo[3.2.1]oct-2-en-3-yl)-benzamide::4-chloranyl-N-[2-(1H-indol-3-yl)ethyl]-N-(8-methyl-8-azabicyclo[3.2.1]oct-3-en-3-yl)benzamide;hydrochloride::4-chloro-N-[2-(1H-indol-3-yl)ethyl]-N-(8-methyl-8-azabicyclo[3.2.1]oct-3-en-3-yl)benzamide;hydrochloride::MLS000558295::SMR000176430::cid_2870044
SMILES [H]C12CCC([H])(C=C(C1)N(CCc1c[nH]c3ccccc13)C(=O)c1ccc(Cl)cc1)N2C
InChI Key InChIKey=HQHQMLBBPGIHNK-UHFFFAOYSA-N
Data  1 EC50
  Tab Delimited (TSV)   2D SDfile   Computed 3D by Vconf -m prep SDfile
Find this compound or compounds like it in BindingDB:
Activity Spreadsheet -- Enzyme Inhibition Constant Data from BindingDB
Found 1 hit for monomerid = 83312
TargetDelta-type opioid receptor(Homo sapiens (Human))
The Scripps Research Institute Molecular Screening Center
Curated by PubChem BioAssay
LigandPNGBDBM83312(4-Chloro-N-[2-(1H-indol-3-yl)-ethyl]-N-(8-methyl-8...)
Affinity DataEC50: >9.25E+4nM. Assay description: Source (MLPCN Center Name): The Scripps Research Institute Molecular Screening Center (SRIMSC) Affiliation: The Scripps Research Institute, TSRI Assa...
In DepthDetails PCBioAssay