BDBM83410 MLS001175046::N-[2-(dimethylamino)-2-(4-methoxyphenyl)ethyl]-3-(3-thienyl)propionamide::N-[2-(dimethylamino)-2-(4-methoxyphenyl)ethyl]-3-(3-thiophenyl)propanamide::N-[2-(dimethylamino)-2-(4-methoxyphenyl)ethyl]-3-thiophen-3-yl-propanamide::N-[2-(dimethylamino)-2-(4-methoxyphenyl)ethyl]-3-thiophen-3-ylpropanamide::SMR000596455::cid_16326480
SMILES COc1ccc(cc1)C(CNC(=O)CCc1ccsc1)N(C)C
InChI Key InChIKey=ORJGOUMNJNMVFR-UHFFFAOYSA-N
Data  1 EC50
  Tab Delimited (TSV)   2D SDfile   Computed 3D by Vconf -m prep SDfile
Find this compound or compounds like it in BindingDB:
Activity Spreadsheet -- Enzyme Inhibition Constant Data from BindingDB
Found 1 hit for monomerid = 83410
TargetDelta-type opioid receptor(Homo sapiens (Human))
The Scripps Research Institute Molecular Screening Center
Curated by PubChem BioAssay
LigandPNGBDBM83410(MLS001175046 | N-[2-(dimethylamino)-2-(4-methoxyph...)
Affinity DataEC50:  2.56E+4nM. Assay description: Source (MLPCN Center Name): The Scripps Research Institute Molecular Screening Center (SRIMSC) Affiliation: The Scripps Research Institute, TSRI Assa...
In DepthDetails PCBioAssay