BDBM83481 2-[1-(3,4-dimethylphenyl)-4-keto-pyrazolo[3,4-d]pyrimidin-5-yl]-N-o-phenetyl-acetamide::2-[1-(3,4-dimethylphenyl)-4-oxidanylidene-pyrazolo[3,4-d]pyrimidin-5-yl]-N-(2-ethoxyphenyl)ethanamide::2-[1-(3,4-dimethylphenyl)-4-oxo-1,4-dihydro-5H-pyrazolo[3,4-d]pyrimidin-5-yl]-N-(2-ethoxyphenyl)acetamide::2-[1-(3,4-dimethylphenyl)-4-oxo-5-pyrazolo[3,4-d]pyrimidinyl]-N-(2-ethoxyphenyl)acetamide::2-[1-(3,4-dimethylphenyl)-4-oxopyrazolo[3,4-d]pyrimidin-5-yl]-N-(2-ethoxyphenyl)acetamide::MLS000093786::SMR000029399::cid_3236282
SMILES CCOc1ccccc1NC(=O)Cn1cnc2n(ncc2c1=O)-c1ccc(C)c(C)c1
InChI Key InChIKey=QWKCWPFTYWDSPI-UHFFFAOYSA-N
Data  2 EC50
  Tab Delimited (TSV)   2D SDfile   Computed 3D by Vconf -m prep SDfile
Find this compound or compounds like it in BindingDB:
Activity Spreadsheet -- Enzyme Inhibition Constant Data from BindingDB
Found 2 hits for monomerid = 83481
TargetEndoribonuclease toxin MazF(Escherichia coli str. K-12 substr. MG1655)
Burnham Center For Chemical Genomics
Curated by PubChem BioAssay
LigandPNGBDBM83481(2-[1-(3,4-dimethylphenyl)-4-keto-pyrazolo[3,4-d]py...)
Affinity DataEC50: >9.90E+4nM. Assay description: Data Source: Sanford-Burnham Center for Chemical Genomics (SBCCG) Source Affiliation: Sanford-Burnham Medical Research Institute (SBMRI, San Diego, C...
In DepthDetails PCBioAssay
TargetEndoribonuclease toxin MazF(Escherichia coli str. K-12 substr. MG1655)
Burnham Center For Chemical Genomics
Curated by PubChem BioAssay
LigandPNGBDBM83481(2-[1-(3,4-dimethylphenyl)-4-keto-pyrazolo[3,4-d]py...)
Affinity DataEC50: >9.90E+4nM. Assay description: Data Source: Sanford-Burnham Center for Chemical Genomics (SBCCG) Source Affiliation: Sanford-Burnham Medical Research Institute (SBMRI, San Diego, C...
In DepthDetails PCBioAssay