BDBM83500 3-Amino-4-furan-2-yl-6,7-dihydro-5H-cyclopenta[b]thieno[3,2-e]pyridine-2-carboxylic acid phenylamide::MLS000556271::SMR000147588::cid_1974623
SMILES Nc1c(sc2nc3CCCc3c(-c3ccco3)c12)C(=O)Nc1ccccc1
InChI Key InChIKey=NPSHXDKPAMHITL-UHFFFAOYSA-N
Data  2 EC50
  Tab Delimited (TSV)   2D SDfile   Computed 3D by Vconf -m prep SDfile
Find this compound or compounds like it in BindingDB:
Activity Spreadsheet -- Enzyme Inhibition Constant Data from BindingDB
Found 2 hits for monomerid = 83500
TargetEndoribonuclease toxin MazF(Escherichia coli str. K-12 substr. MG1655)
Burnham Center For Chemical Genomics
Curated by PubChem BioAssay
LigandPNGBDBM83500(3-Amino-4-furan-2-yl-6,7-dihydro-5H-cyclopenta[b]t...)
Affinity DataEC50: >9.90E+4nM. Assay description: Data Source: Sanford-Burnham Center for Chemical Genomics (SBCCG) Source Affiliation: Sanford-Burnham Medical Research Institute (SBMRI, San Diego, C...
In DepthDetails PCBioAssay
TargetEndoribonuclease toxin MazF(Escherichia coli str. K-12 substr. MG1655)
Burnham Center For Chemical Genomics
Curated by PubChem BioAssay
LigandPNGBDBM83500(3-Amino-4-furan-2-yl-6,7-dihydro-5H-cyclopenta[b]t...)
Affinity DataEC50:  1.13E+4nM. Assay description: Data Source: Sanford-Burnham Center for Chemical Genomics (SBCCG) Source Affiliation: Sanford-Burnham Medical Research Institute (SBMRI, San Diego, C...
In DepthDetails PCBioAssay