BDBM83655 (E)-2-cyano-3-[4-(methylamino)-3-nitro-phenyl]-N-(2-pyridyl)acrylamide::(E)-2-cyano-3-[4-(methylamino)-3-nitro-phenyl]-N-pyridin-2-yl-prop-2-enamide::(E)-2-cyano-3-[4-(methylamino)-3-nitrophenyl]-N-(2-pyridinyl)-2-propenamide::(E)-2-cyano-3-[4-(methylamino)-3-nitrophenyl]-N-pyridin-2-ylprop-2-enamide::MLS001171340::SMR000589564::cid_6311448
SMILES CNc1ccc(\C=C(/C#N)C(=O)Nc2ccccn2)cc1[N+]([O-])=O
InChI Key InChIKey=FPUQPGSEJRDRMP-XYOKQWHBSA-N
Data  2 EC50
  Tab Delimited (TSV)   2D SDfile   Computed 3D by Vconf -m prep SDfile
Find this compound or compounds like it in BindingDB:
Activity Spreadsheet -- Enzyme Inhibition Constant Data from BindingDB
Found 2 hits for monomerid = 83655
TargetEndoribonuclease toxin MazF(Escherichia coli str. K-12 substr. MG1655)
Burnham Center For Chemical Genomics
Curated by PubChem BioAssay
LigandPNGBDBM83655((E)-2-cyano-3-[4-(methylamino)-3-nitro-phenyl]-N-(...)
Affinity DataEC50: >9.90E+4nM. Assay description: Data Source: Sanford-Burnham Center for Chemical Genomics (SBCCG) Source Affiliation: Sanford-Burnham Medical Research Institute (SBMRI, San Diego, C...
In DepthDetails PCBioAssay
TargetEndoribonuclease toxin MazF(Escherichia coli str. K-12 substr. MG1655)
Burnham Center For Chemical Genomics
Curated by PubChem BioAssay
LigandPNGBDBM83655((E)-2-cyano-3-[4-(methylamino)-3-nitro-phenyl]-N-(...)
Affinity DataEC50:  3.92E+4nM. Assay description: Data Source: Sanford-Burnham Center for Chemical Genomics (SBCCG) Source Affiliation: Sanford-Burnham Medical Research Institute (SBMRI, San Diego, C...
In DepthDetails PCBioAssay