BDBM83720 6-(2-naphthalenylsulfonyl)quinazoline-2,4-diamine::6-naphthalen-2-ylsulfonylquinazoline-2,4-diamine::MLS002920661::SMR001798248::WR 158122::[2-amino-6-(2-naphthylsulfonyl)quinazolin-4-yl]amine::cid_98652
SMILES Nc1nc(N)c2cc(ccc2n1)S(=O)(=O)c1ccc2ccccc2c1
InChI Key InChIKey=GBVQWZXJDIIUCC-UHFFFAOYSA-N
Data  1 IC50  2 EC50
  Tab Delimited (TSV)   2D SDfile   Computed 3D by Vconf -m prep SDfile
Find this compound or compounds like it in BindingDB:
Activity Spreadsheet -- Enzyme Inhibition Constant Data from BindingDB
Found 3 hits for monomerid = 83720
TargetEndoribonuclease toxin MazF(Escherichia coli str. K-12 substr. MG1655)
Burnham Center For Chemical Genomics
Curated by PubChem BioAssay
LigandPNGBDBM83720(6-(2-naphthalenylsulfonyl)quinazoline-2,4-diamine ...)
Affinity DataEC50: >9.90E+4nM. Assay description: Data Source: Sanford-Burnham Center for Chemical Genomics (SBCCG) Source Affiliation: Sanford-Burnham Medical Research Institute (SBMRI, San Diego, C...
In DepthDetails PCBioAssay
LigandPNGBDBM83720(6-(2-naphthalenylsulfonyl)quinazoline-2,4-diamine ...)
Affinity DataIC50:  0.0200nM. Assay description: Antibacterial activity against Streptococcus faecalis assessed as growth inhibition
In DepthDetails ArticlePubMed
TargetEndoribonuclease toxin MazF(Escherichia coli str. K-12 substr. MG1655)
Burnham Center For Chemical Genomics
Curated by PubChem BioAssay
LigandPNGBDBM83720(6-(2-naphthalenylsulfonyl)quinazoline-2,4-diamine ...)
Affinity DataEC50: >9.90E+4nM. Assay description: Data Source: Sanford-Burnham Center for Chemical Genomics (SBCCG) Source Affiliation: Sanford-Burnham Medical Research Institute (SBMRI, San Diego, C...
In DepthDetails PCBioAssay