BDBM84042 3-chloranyl-N-(6-chloranyl-1,3-benzothiazol-2-yl)thiophene-2-carboxamide::3-chloro-N-(6-chloro-1,3-benzothiazol-2-yl)-2-thiophenecarboxamide::3-chloro-N-(6-chloro-1,3-benzothiazol-2-yl)thiophene-2-carboxamide::MLS-0454430.0001::cid_49852503
SMILES Clc1ccsc1C(=O)Nc1nc2ccc(Cl)cc2s1
InChI Key InChIKey=JIFQARCSCBNIIB-UHFFFAOYSA-N
Data  1 IC50
  Tab Delimited (TSV)   2D SDfile   Computed 3D by Vconf -m prep SDfile
Find this compound or compounds like it in BindingDB:
Activity Spreadsheet -- Enzyme Inhibition Constant Data from BindingDB
Found 1 hit for monomerid = 84042
TargetSentrin-specific protease 8(Homo sapiens (Human))
Burnham Center For Chemical Genomics
Curated by PubChem BioAssay
LigandPNGBDBM84042(3-chloranyl-N-(6-chloranyl-1,3-benzothiazol-2-yl)t...)
Affinity DataIC50:  9.04E+3nM. Assay description: Data Source: Sanford-Burnham Center for Chemical Genomics (SBCCG) Source Affiliation: Sanford-Burnham Medical Research Institute (SBMRI, San Diego, C...
In DepthDetails PCBioAssay