BDBM84059 1-(3,4-dihydro-2H-quinolin-1-yl)-2-(1H-indol-3-yl)ethane-1,2-dione::MLS-0092025.0002::cid_1588017
SMILES O=C(N1CCCc2ccccc12)C(=O)c1c[nH]c2ccccc12
InChI Key InChIKey=RFORWCTVSFTKHL-UHFFFAOYSA-N
Data  1 IC50
  Tab Delimited (TSV)   2D SDfile   Computed 3D by Vconf -m prep SDfile
Find this compound or compounds like it in BindingDB:
Activity Spreadsheet -- Enzyme Inhibition Constant Data from BindingDB
Found 1 hit for monomerid = 84059
TargetSentrin-specific protease 8(Homo sapiens (Human))
Burnham Center For Chemical Genomics
Curated by PubChem BioAssay
LigandPNGBDBM84059(1-(3,4-dihydro-2H-quinolin-1-yl)-2-(1H-indol-3-yl)...)
Affinity DataIC50: >9.90E+4nM. Assay description: Data Source: Sanford-Burnham Center for Chemical Genomics (SBCCG) Source Affiliation: Sanford-Burnham Medical Research Institute (SBMRI, San Diego, C...
In DepthDetails PCBioAssay