BDBM84063 2-[5-bromanyl-3-cyano-4-(methoxymethyl)-6-methyl-pyridin-2-yl]oxy-N'-[(Z)-indol-3-ylidenemethyl]ethanehydrazide::2-[5-bromo-3-cyano-4-(methoxymethyl)-6-methylpyridin-2-yl]oxy-N'-[(Z)-indol-3-ylidenemethyl]acetohydrazide::2-[[5-bromo-3-cyano-4-(methoxymethyl)-6-methyl-2-pyridinyl]oxy]-N'-[(Z)-3-indolylidenemethyl]acetohydrazide::2-[[5-bromo-3-cyano-4-(methoxymethyl)-6-methyl-2-pyridyl]oxy]-N'-[(Z)-indol-3-ylidenemethyl]acetohydrazide::MLS-0454617.0002::cid_46495746
SMILES COCc1c(Br)c(C)nc(OCC(=O)NN=Cc2c[nH]c3ccccc23)c1C#N
InChI Key InChIKey=PNQYEDGVPBHVBT-PGGKNCGUSA-N
Data  1 IC50
  Tab Delimited (TSV)   2D SDfile   Computed 3D by Vconf -m prep SDfile
Find this compound or compounds like it in BindingDB:
Activity Spreadsheet -- Enzyme Inhibition Constant Data from BindingDB
Found 1 hit for monomerid = 84063
TargetSentrin-specific protease 8(Homo sapiens (Human))
Burnham Center For Chemical Genomics
Curated by PubChem BioAssay
LigandPNGBDBM84063(2-[5-bromanyl-3-cyano-4-(methoxymethyl)-6-methyl-p...)
Affinity DataIC50: >9.90E+4nM. Assay description: Data Source: Sanford-Burnham Center for Chemical Genomics (SBCCG) Source Affiliation: Sanford-Burnham Medical Research Institute (SBMRI, San Diego, C...
In DepthDetails PCBioAssay