BDBM84080 MLS-0454653.0002::N-[3-(4-ethyl-1-piperazinyl)propyl]-2-(1H-indol-3-yl)-2-oxoacetamide::N-[3-(4-ethylpiperazin-1-yl)propyl]-2-(1H-indol-3-yl)-2-oxidanylidene-ethanamide::N-[3-(4-ethylpiperazin-1-yl)propyl]-2-(1H-indol-3-yl)-2-oxoacetamide::N-[3-(4-ethylpiperazino)propyl]-2-(1H-indol-3-yl)-2-keto-acetamide::cid_7117425
SMILES CCN1CCN(CCCNC(=O)C(=O)c2c[nH]c3ccccc23)CC1
InChI Key InChIKey=ZXVBAXJWBHKMME-UHFFFAOYSA-N
Data  1 IC50
  Tab Delimited (TSV)   2D SDfile   Computed 3D by Vconf -m prep SDfile
Find this compound or compounds like it in BindingDB:
Activity Spreadsheet -- Enzyme Inhibition Constant Data from BindingDB
Found 1 hit for monomerid = 84080
TargetSentrin-specific protease 8(Homo sapiens (Human))
Burnham Center For Chemical Genomics
Curated by PubChem BioAssay
LigandPNGBDBM84080(MLS-0454653.0002 | N-[3-(4-ethyl-1-piperazinyl)pro...)
Affinity DataIC50: >9.90E+4nM. Assay description: Data Source: Sanford-Burnham Center for Chemical Genomics (SBCCG) Source Affiliation: Sanford-Burnham Medical Research Institute (SBMRI, San Diego, C...
In DepthDetails PCBioAssay