BDBM84112 MLS000554997::N-Benzooxazol-2-yl-N',N''-dibenzoyl-guanidine::N-[N'-(1,3-benzoxazol-2-yl)-N-(phenylcarbonyl)carbamimidoyl]benzamide::N-[N'-(1,3-benzoxazol-2-yl)-N-benzoyl-amidino]benzamide::N-[N'-(1,3-benzoxazol-2-yl)-N-benzoylcarbamimidoyl]benzamide::N-[benzamido(1,3-benzoxazol-2-ylimino)methyl]benzamide::SMR000147114::cid_3846713
SMILES O=[#6](-[#7]\[#6](-[#7]-[#6](=O)-c1ccccc1)=[#7]/c1nc2ccccc2o1)-c1ccccc1
InChI Key InChIKey=IPXCLVGMBFZCFD-UHFFFAOYSA-N
Data  1 EC50
  Tab Delimited (TSV)   2D SDfile   Computed 3D by Vconf -m prep SDfile
Find this compound or compounds like it in BindingDB:
Activity Spreadsheet -- Enzyme Inhibition Constant Data from BindingDB
Found 1 hit for monomerid = 84112
TargetMultidrug resistance protein CDR2(Candida albicans)
Nmmlsc
Curated by PubChem BioAssay
LigandPNGBDBM84112(MLS000554997 | N-Benzooxazol-2-yl-N',N'...)
Affinity DataEC50:  1.53E+3nM. Assay description: UNMCMD Assay Overview: Assay Support: 1 R03 MH087406-01A1 Project Title: Identification of broad-spectrum antifungal efflux pump inhibitors ...
In DepthDetails PCBioAssay