BDBM84114 (5E)-2-(butylthio)-3-phenyl-5-(3-thenylidene)-2-imidazolin-4-one::(5E)-2-(butylthio)-3-phenyl-5-(3-thiophenylmethylidene)-4-imidazolone::(5E)-2-(butylthio)-3-phenyl-5-(thien-3-ylmethylene)-3,5-dihydro-4H-imidazol-4-one::(5E)-2-butylsulfanyl-3-phenyl-5-(thiophen-3-ylmethylidene)imidazol-4-one::MLS000583024::SMR000206210::cid_12005187
SMILES CCCCSC1=N\C(=C\c2ccsc2)C(=O)N1c1ccccc1
InChI Key InChIKey=HZWFQMGQVMSGMQ-FOWTUZBSSA-N
Data  1 EC50
  Tab Delimited (TSV)   2D SDfile   Computed 3D by Vconf -m prep SDfile
Find this compound or compounds like it in BindingDB:
Activity Spreadsheet -- Enzyme Inhibition Constant Data from BindingDB
Found 1 hit for monomerid = 84114
TargetMultidrug resistance protein CDR2(Candida albicans)
Nmmlsc
Curated by PubChem BioAssay
LigandPNGBDBM84114((5E)-2-(butylthio)-3-phenyl-5-(3-thenylidene)-2-im...)
Affinity DataEC50:  1.03E+4nM. Assay description: UNMCMD Assay Overview: Assay Support: 1 R03 MH087406-01A1 Project Title: Identification of broad-spectrum antifungal efflux pump inhibitors ...
In DepthDetails PCBioAssay