BDBM84200 2-[[4-(furan-2-ylmethyl)-5-[(4-methylphenoxy)methyl]-1,2,4-triazol-3-yl]sulfanylmethyl]-1H-benzimidazole::2-[[[4-(2-furanylmethyl)-5-[(4-methylphenoxy)methyl]-1,2,4-triazol-3-yl]thio]methyl]-1H-benzimidazole::2-[[[4-(2-furfuryl)-5-[(4-methylphenoxy)methyl]-1,2,4-triazol-3-yl]thio]methyl]-1H-benzimidazole::MLS000083128::SMR000046011::cid_664890
SMILES Cc1ccc(OCc2nnc(SCc3nc4ccccc4[nH]3)n2Cc2ccco2)cc1
InChI Key InChIKey=YUQLAZKXJUHBQP-UHFFFAOYSA-N
Data  1 EC50
  Tab Delimited (TSV)   2D SDfile   Computed 3D by Vconf -m prep SDfile
Find this compound or compounds like it in BindingDB:
Activity Spreadsheet -- Enzyme Inhibition Constant Data from BindingDB
Found 1 hit for monomerid = 84200
TargetBeta-2 adrenergic receptor(Homo sapiens (Human))
Nmmlsc
Curated by PubChem BioAssay
LigandPNGBDBM84200(2-[[4-(furan-2-ylmethyl)-5-[(4-methylphenoxy)methy...)
Affinity DataEC50:  1.08E+3nM. Assay description: University of New Mexico Assay Overview: Assay Support: R03 MH093192-01 Project Title: HTS for Non-Canonical Ligands for Beta 2 Adrenergic Receptor...
In DepthDetails PCBioAssay