BDBM84263 2-({4-[(2-furylmethyl)amino]-2-quinazolinyl}amino)phenol hydrochloride::2-[[4-(2-furanylmethylamino)-2-quinazolinyl]amino]phenol;hydrochloride::2-[[4-(2-furfurylamino)quinazolin-2-yl]amino]phenol;hydrochloride::2-[[4-(furan-2-ylmethylamino)quinazolin-2-yl]amino]phenol;hydrochloride::MLS000693437::SMR000299981::cid_2952918
SMILES Oc1ccccc1Nc1nc(NCc2ccco2)c2ccccc2n1
InChI Key InChIKey=NIXDVXSPFPQLRV-UHFFFAOYSA-N
Data  1 EC50
  Tab Delimited (TSV)   2D SDfile   Computed 3D by Vconf -m prep SDfile
Find this compound or compounds like it in BindingDB:
Activity Spreadsheet -- Enzyme Inhibition Constant Data from BindingDB
Found 1 hit for monomerid = 84263
TargetBeta-2 adrenergic receptor(Homo sapiens (Human))
Nmmlsc
Curated by PubChem BioAssay
LigandPNGBDBM84263(2-({4-[(2-furylmethyl)amino]-2-quinazolinyl}amino)...)
Affinity DataEC50:  492nM. Assay description: University of New Mexico Assay Overview: Assay Support: R03 MH093192-01 Project Title: HTS for Non-Canonical Ligands for Beta 2 Adrenergic Receptor...
In DepthDetails PCBioAssay