BDBM84267 MLS000674147::N-butyl-4-(2-methylpropanoylamino)-N-phenyl-benzamide::N-butyl-4-(2-methylpropanoylamino)-N-phenylbenzamide::N-butyl-4-(isobutyrylamino)-N-phenyl-benzamide::N-butyl-4-(isobutyrylamino)-N-phenylbenzamide::N-butyl-4-[(2-methyl-1-oxopropyl)amino]-N-phenylbenzamide::SMR000297039::cid_2986164
SMILES CCCCN(C(=O)c1ccc(NC(=O)C(C)C)cc1)c1ccccc1
InChI Key InChIKey=USDKDUDKUXADFB-UHFFFAOYSA-N
Data  1 EC50
  Tab Delimited (TSV)   2D SDfile   Computed 3D by Vconf -m prep SDfile
Find this compound or compounds like it in BindingDB:
Activity Spreadsheet -- Enzyme Inhibition Constant Data from BindingDB
Found 1 hit for monomerid = 84267
TargetBeta-2 adrenergic receptor(Homo sapiens (Human))
Nmmlsc
Curated by PubChem BioAssay
LigandPNGBDBM84267(MLS000674147 | N-butyl-4-(2-methylpropanoylamino)-...)
Affinity DataEC50:  49nM. Assay description: University of New Mexico Assay Overview: Assay Support: R03 MH093192-01 Project Title: HTS for Non-Canonical Ligands for Beta 2 Adrenergic Receptor...
In DepthDetails PCBioAssay