BDBM84565 Linked sulfated tetracyclitol, 6
SMILES [O-]S(=O)(=O)O[C@@H]1C=C[C@@H]([C@@H](OS([O-])(=O)=O)[C@@H]1OS([O-])(=O)=O)N(CCCCCCN([C@H]1C=C[C@@H](OS([O-])(=O)=O)[C@@H](OS([O-])(=O)=O)[C@@H]1OS([O-])(=O)=O)[C@H]1C=C[C@@H](OS([O-])(=O)=O)[C@@H](OS([O-])(=O)=O)[C@@H]1OS([O-])(=O)=O)[C@H]1C=C[C@@H](OS([O-])(=O)=O)[C@@H](OS([O-])(=O)=O)[C@@H]1OS([O-])(=O)=O
InChI Key InChIKey=JLPWOYBTQYDCQU-UBNJDMFZSA-B
Data  2 Kd
  Tab Delimited (TSV)   2D SDfile   Computed 3D by Vconf -m prep SDfile
Find this compound or compounds like it in BindingDB:
Activity Spreadsheet -- Enzyme Inhibition Constant Data from BindingDB
Found 2 hits for monomerid = 84565
TargetFibroblast growth factor 2(Homo sapiens (Human))
Progen Industries
LigandPNGBDBM84565(Linked sulfated tetracyclitol, 6)
Affinity DataKd:  135nMpH: 7.4Assay Description:Human FGF-1 and FGF-2 were purchased from R&D Systems, Inc. and supplied as protein (ug) dissolved in bovine serum albumin (BSA, 50ug). Surface plas...Checked by Author
In DepthDetails ArticlePubMed
TargetFibroblast growth factor 1(Homo sapiens (Human))
Progen Industries
LigandPNGBDBM84565(Linked sulfated tetracyclitol, 6)
Affinity DataKd:  39nMpH: 7.4Assay Description:Human FGF-1 and FGF-2 were purchased from R&D Systems, Inc. and supplied as protein (ug) dissolved in bovine serum albumin (BSA, 50ug). Surface plas...Checked by Author
In DepthDetails ArticlePubMed