BDBM84867 Swainsonine derivative, 2
SMILES O[C@@H]1CN2C([C@@H]1O)[C@H](O)CC[C@@H]2CC(=O)c1ccccc1
InChI Key InChIKey=HEBIMHSFXQMUTK-ZKUQWXIPSA-N
Data  1 KI  1 IC50
  Tab Delimited (TSV)   2D SDfile   Computed 3D by Vconf -m prep SDfile
Find this compound or compounds like it in BindingDB:
Activity Spreadsheet -- Enzyme Inhibition Constant Data from BindingDB
Found 1 hit for monomerid = 84867
TargetAlpha-mannosidase 2(Drosophila melanogaster (Fruit fly))
University Of Toronto
LigandPNGBDBM84867(Swainsonine derivative, 2)
Affinity DataKi:  2.80nM ΔG°:  -11.7kcal/mole IC50:  30nMpH: 5.75 T: 2°C. Assay description: Inhibition of dGMII was measured at pH 5.75. Determination of the IC50 values (concentrations of inhibitor at which 50% of activity remains) was car...
In DepthDetails ArticlePubMed