BDBM86247 BAY X 9228::CAS_3038059::NSC_3038059
SMILES CCOc1ccccc1N=C(C[N+]([O-])=O)NC(C)C(C)(C)C
InChI Key InChIKey=PFESSMRIEPRWBT-UHFFFAOYSA-N
Data  2 KI
  Tab Delimited (TSV)   2D SDfile   Computed 3D by Vconf -m prep SDfile
Find this compound or compounds like it in BindingDB:
Activity Spreadsheet -- Enzyme Inhibition Constant Data from BindingDB
Found 2 hits for monomerid = 86247
TargetCalcium-activated potassium channel subunit beta(GUINEA PIG)
Abbott Laboratories
Curated by PDSP Ki Database
LigandPNGBDBM86247(BAY X 9228 | CAS_3038059 | NSC_3038059)
Affinity DataKi:  16nM
Ligand InfoPC cidPC sid
In DepthDetails ArticlePubMed
TargetCalcium-activated potassium channel subunit beta(GUINEA PIG)
Abbott Laboratories
Curated by PDSP Ki Database
LigandPNGBDBM86247(BAY X 9228 | CAS_3038059 | NSC_3038059)
Affinity DataKi:  41.3nM
Ligand InfoPC cidPC sid
In DepthDetails ArticlePubMed