BDBM86458 (+/-)-3-n-butyldinapsoline hydrobromide
SMILES CCCCC1NC[C@H]2c3ccc(O)c(O)c3Cc3cccc1c23
InChI Key InChIKey=JESNJOJDSRVNBV-BHWOMJMDSA-N
Data  2 KI
  Tab Delimited (TSV)   2D SDfile   Computed 3D by Vconf -m prep SDfile
Find this compound or compounds like it in BindingDB:
Activity Spreadsheet -- Enzyme Inhibition Constant Data from BindingDB
Found 2 hits for monomerid = 86458
TargetD(2) dopamine receptor(Rattus norvegicus (rat))
Bristol-Myers Squibb Pharmaceutical Research Institute
Curated by PDSP Ki Database
LigandPNGBDBM86458((+/-)-3-n-butyldinapsoline hydrobromide)
Affinity DataKi:  93nM
In DepthDetails ArticlePubMed
TargetD(1A) dopamine receptor(RAT)
Bristol-Myers Squibb Pharmaceutical Research Institute
Curated by PDSP Ki Database
LigandPNGBDBM86458((+/-)-3-n-butyldinapsoline hydrobromide)
Affinity DataKi:  299nM
In DepthDetails ArticlePubMed