BDBM86771 Nicotinamide hydrochloride analog, 6d
SMILES NNc1ccc(cc1)C(=O)NCCCCCCCCCNc1c2CCCCc2nc2ccccc12
InChI Key InChIKey=HATKEYWIFSQUFJ-UHFFFAOYSA-N
Data  2 IC50
  Tab Delimited (TSV)   2D SDfile   Computed 3D by Vconf -m prep SDfile
Find this compound or compounds like it in BindingDB:
Activity Spreadsheet -- Enzyme Inhibition Constant Data from BindingDB
Found 2 hits for monomerid = 86771
TargetCarboxylic ester hydrolase(Equus caballus (Horse))
Medical University Of Lodz
LigandPNGBDBM86771(Nicotinamide hydrochloride analog, 6d)
Affinity DataIC50:  0.811nM. Assay description: Enzyme activity using acetylcholinesterase (AChE) and butyrylcholinesterase (BChE).
In DepthDetails ArticlePubMed
TargetAcetylcholinesterase(Electrophorus electricus (Electric eel))
Medical University Of Lodz
LigandPNGBDBM86771(Nicotinamide hydrochloride analog, 6d)
Affinity DataIC50:  370nM. Assay description: Enzyme activity using acetylcholinesterase (AChE) and butyrylcholinesterase (BChE).
In DepthDetails ArticlePubMed