BDBM87117 2-[(5-oxidanylidene-4-propyl-[1,2,4]triazolo[4,3-a]quinazolin-1-yl)sulfanyl]-N-(phenylmethyl)ethanamide::2-[(5-oxo-4-propyl-[1,2,4]triazolo[4,3-a]quinazolin-1-yl)thio]-N-(phenylmethyl)acetamide::MLS-0463496.0001::N-benzyl-2-[(5-keto-4-propyl-[1,2,4]triazolo[4,3-a]quinazolin-1-yl)thio]acetamide::N-benzyl-2-[(5-oxo-4-propyl-[1,2,4]triazolo[4,3-a]quinazolin-1-yl)sulfanyl]acetamide::cid_2493460
SMILES CCCn1c2nnc(SCC(=O)NCc3ccccc3)n2c2ccccc2c1=O
InChI Key InChIKey=PXDGCWYFPDQSDG-UHFFFAOYSA-N
Data  1 IC50
  Tab Delimited (TSV)   2D SDfile   Computed 3D by Vconf -m prep SDfile
Find this compound or compounds like it in BindingDB:
Activity Spreadsheet -- Enzyme Inhibition Constant Data from BindingDB
Found 1 hit for monomerid = 87117
TargetDNA dC->dU-editing enzyme APOBEC-3G(Homo sapiens (Human))
Burnham Center For Chemical Genomics
Curated by PubChem BioAssay
LigandPNGBDBM87117(2-[(5-oxidanylidene-4-propyl-[1,2,4]triazolo[4,3-a...)
Affinity DataIC50: >9.90E+4nMT: 2°C. Assay description: Data Source: Sanford-Burnham Center for Chemical Genomics (SBCCG) Source Affiliation: Sanford-Burnham Medical Research Institute (SBMRI, San Diego, C...
In DepthDetails PCBioAssay