BDBM87162 N-[2-(3-methyl-4-oxidanylidene-1-phenyl-1,3,8-triazaspiro[4.5]decan-8-yl)ethyl]naphthalene-2-carboxamide::N-[2-(3-methyl-4-oxo-1-phenyl-1,3,8-triazaspiro[4.5]decan-8-yl)ethyl]-2-naphthalenecarboxamide::N-[2-(3-methyl-4-oxo-1-phenyl-1,3,8-triazaspiro[4.5]decan-8-yl)ethyl]naphthalene-2-carboxamide::N-[2-(4-keto-3-methyl-1-phenyl-1,3,8-triazaspiro[4.5]decan-8-yl)ethyl]-2-naphthamide::VU0404363-1::cid_53469965
SMILES CN1CN(c2ccccc2)C2(CCN(CCNC(=O)c3ccc4ccccc4c3)CC2)C1=O
InChI Key InChIKey=MEUUAOBDTAVZNS-UHFFFAOYSA-N
Data  2 IC50
  Tab Delimited (TSV)   2D SDfile   Computed 3D by Vconf -m prep SDfile
Find this compound or compounds like it in BindingDB:
Activity Spreadsheet -- Enzyme Inhibition Constant Data from BindingDB
Found 2 hits for monomerid = 87162
TargetPhospholipase D1(Homo sapiens (Human))
Vanderbilt Specialized Chemistry Center
Curated by PubChem BioAssay
LigandPNGBDBM87162(N-[2-(3-methyl-4-oxidanylidene-1-phenyl-1,3,8-tria...)
Affinity DataIC50:  2.80E+3nM. Assay description: Phospholipase D (PLD) generates the lipid second messenger phosphatidic acid as part of a plethora of cellular functions. Phosphatidic acid (PtdOH) i...
In DepthDetails PCBioAssay
TargetPhospholipase D2(Homo sapiens (Human))
Vanderbilt Specialized Chemistry Center
Curated by PubChem BioAssay
LigandPNGBDBM87162(N-[2-(3-methyl-4-oxidanylidene-1-phenyl-1,3,8-tria...)
Affinity DataIC50:  2.00E+4nM. Assay description: Phospholipase D (PLD) generates the lipid second messenger phosphatidic acid as part of a plethora of cellular functions. Phosphatidic acid (PtdOH) i...
In DepthDetails PCBioAssay