BDBM87166 5-fluoranyl-N-[2-[1-(4-fluorophenyl)-4-oxidanylidene-1,3,8-triazaspiro[4.5]decan-8-yl]ethyl]-1H-indole-2-carboxamide;2,2,2-tris(fluoranyl)ethanoic acid::5-fluoro-N-[2-[1-(4-fluorophenyl)-4-keto-1,3,8-triazaspiro[4.5]decan-8-yl]ethyl]-1H-indole-2-carboxamide;2,2,2-trifluoroacetic acid::5-fluoro-N-[2-[1-(4-fluorophenyl)-4-oxo-1,3,8-triazaspiro[4.5]decan-8-yl]ethyl]-1H-indole-2-carboxamide;2,2,2-trifluoroacetic acid::CHEMBL1253900::VU0402722-1::cid_46938536
SMILES Fc1ccc(cc1)N1CNC(=O)C11CCN(CCNC(=O)c2cc3cc(F)ccc3[nH]2)CC1
InChI Key InChIKey=ARUKIZSLQFCUHJ-UHFFFAOYSA-N
Data  6 IC50
  Tab Delimited (TSV)   2D SDfile   Computed 3D by Vconf -m prep SDfile
Find this compound or compounds like it in BindingDB:
Activity Spreadsheet -- Enzyme Inhibition Constant Data from BindingDB
Found 6 hits for monomerid = 87166
TargetPhospholipase D2(Homo sapiens (Human))
Vanderbilt Specialized Chemistry Center
Curated by PubChem BioAssay
LigandPNGBDBM87166(5-fluoranyl-N-[2-[1-(4-fluorophenyl)-4-oxidanylide...)
Affinity DataIC50:  27nM. Assay description: Phospholipase D (PLD) generates the lipid second messenger phosphatidic acid as part of a plethora of cellular functions. Phosphatidic acid (PtdOH) i...
In DepthDetails PCBioAssay
TargetPhospholipase D2(Homo sapiens (Human))
Vanderbilt Specialized Chemistry Center
Curated by PubChem BioAssay
LigandPNGBDBM87166(5-fluoranyl-N-[2-[1-(4-fluorophenyl)-4-oxidanylide...)
Affinity DataIC50:  66nM. Assay description: Phospholipase D (PLD) generates the lipid second messenger phosphatidic acid as part of a plethora of cellular functions. Phosphatidic acid (PtdOH) i...
In DepthDetails PCBioAssay
TargetPhospholipase D2(Homo sapiens (Human))
Vanderbilt Specialized Chemistry Center
Curated by PubChem BioAssay
LigandPNGBDBM87166(5-fluoranyl-N-[2-[1-(4-fluorophenyl)-4-oxidanylide...)
Affinity DataIC50:  30nM. Assay description: Inhibition of human GST-tagged PLD2A in human HEK293 cells
In DepthDetails ArticlePubMed
TargetPhospholipase D1(Homo sapiens (Human))
Vanderbilt Specialized Chemistry Center
Curated by PubChem BioAssay
LigandPNGBDBM87166(5-fluoranyl-N-[2-[1-(4-fluorophenyl)-4-oxidanylide...)
Affinity DataIC50:  290nM. Assay description: Phospholipase D (PLD) generates the lipid second messenger phosphatidic acid as part of a plethora of cellular functions. Phosphatidic acid (PtdOH) i...
In DepthDetails PCBioAssay
TargetPhospholipase D1(Homo sapiens (Human))
Vanderbilt Specialized Chemistry Center
Curated by PubChem BioAssay
LigandPNGBDBM87166(5-fluoranyl-N-[2-[1-(4-fluorophenyl)-4-oxidanylide...)
Affinity DataIC50:  290nM. Assay description: Inhibition of PLD1 in human calu1 cells
In DepthDetails ArticlePubMed
TargetPhospholipase D1(Homo sapiens (Human))
Vanderbilt Specialized Chemistry Center
Curated by PubChem BioAssay
LigandPNGBDBM87166(5-fluoranyl-N-[2-[1-(4-fluorophenyl)-4-oxidanylide...)
Affinity DataIC50:  5.50E+3nM. Assay description: Phospholipase D (PLD) generates the lipid second messenger phosphatidic acid as part of a plethora of cellular functions. Phosphatidic acid (PtdOH) i...
In DepthDetails PCBioAssay