BDBM87181 N-[(1R)-2-[4-(5-chloro-2-keto-3H-benzimidazol-1-yl)piperidino]-1-methyl-ethyl]-2-naphthamide::N-[(2R)-1-[4-(5-chloranyl-2-oxidanylidene-3H-benzimidazol-1-yl)piperidin-1-yl]propan-2-yl]naphthalene-2-carboxamide::N-[(2R)-1-[4-(5-chloro-2-oxo-3H-benzimidazol-1-yl)-1-piperidinyl]propan-2-yl]-2-naphthalenecarboxamide::N-[(2R)-1-[4-(5-chloro-2-oxo-3H-benzimidazol-1-yl)piperidin-1-yl]propan-2-yl]naphthalene-2-carboxamide::VU0364740-1::cid_53470046
SMILES C[C@H](CN1CCC(CC1)n1c2ccc(Cl)cc2[nH]c1=O)NC(=O)c1ccc2ccccc2c1
InChI Key InChIKey=DRIMIUYGTDAQOX-QGZVFWFLSA-N
Data  2 IC50
  Tab Delimited (TSV)   2D SDfile   Computed 3D by Vconf -m prep SDfile
Find this compound or compounds like it in BindingDB:
Activity Spreadsheet -- Enzyme Inhibition Constant Data from BindingDB
Found 2 hits for monomerid = 87181
TargetPhospholipase D1(Homo sapiens (Human))
Vanderbilt Specialized Chemistry Center
Curated by PubChem BioAssay
LigandPNGBDBM87181(N-[(1R)-2-[4-(5-chloro-2-keto-3H-benzimidazol-1-yl...)
Affinity DataIC50:  60nM. Assay description: Phospholipase D (PLD) generates the lipid second messenger phosphatidic acid as part of a plethora of cellular functions. Phosphatidic acid (PtdOH) i...
In DepthDetails PCBioAssay
TargetPhospholipase D2(Homo sapiens (Human))
Vanderbilt Specialized Chemistry Center
Curated by PubChem BioAssay
LigandPNGBDBM87181(N-[(1R)-2-[4-(5-chloro-2-keto-3H-benzimidazol-1-yl...)
Affinity DataIC50:  3.70E+3nM. Assay description: Phospholipase D (PLD) generates the lipid second messenger phosphatidic acid as part of a plethora of cellular functions. Phosphatidic acid (PtdOH) i...
In DepthDetails PCBioAssay