BDBM87428 2-(3-Chloro-phenyl)-3-phenyl-tetrahydro-pyrazolo[1,2-a][1,2,4]triazol-1-one::2-(3-chlorophenyl)-1-phenyl-1,5,6,7-tetrahydropyrazolo[1,2-a][1,2,4]triazol-3-one::MLS000590580::SMR000217604::cid_3514222
SMILES Clc1cccc(c1)N1C(N2CCCN2C1=O)c1ccccc1
InChI Key InChIKey=QJOAGIGJWYFXBX-UHFFFAOYSA-N
Data  1 IC50
  Tab Delimited (TSV)   2D SDfile   Computed 3D by Vconf -m prep SDfile
Find this compound or compounds like it in BindingDB:
Activity Spreadsheet -- Enzyme Inhibition Constant Data from BindingDB
Found 1 hit for monomerid = 87428
TargetTyrosine-protein kinase ABL1(Homo sapiens (Human))
The Scripps Research Institute Molecular Screening Center
Curated by PubChem BioAssay
LigandPNGBDBM87428(2-(3-Chloro-phenyl)-3-phenyl-tetrahydro-pyrazolo[1...)
Affinity DataIC50:  2.22E+4nM. Assay description: Source (MLPCN Center Name): The Scripps Research Institute Molecular Screening Center (SRIMSC) Affiliation: The Scripps Research Institute, TSRI Assa...
In DepthDetails PCBioAssay