BDBM87485 7-chloranyl-N-[2-(dimethylamino)-2-(furan-2-yl)ethyl]-3-methyl-1-benzofuran-2-carboxamide::7-chloro-N-[2-(dimethylamino)-2-(2-furanyl)ethyl]-3-methyl-2-benzofurancarboxamide::7-chloro-N-[2-(dimethylamino)-2-(2-furyl)ethyl]-3-methyl-coumarilamide::7-chloro-N-[2-(dimethylamino)-2-(furan-2-yl)ethyl]-3-methyl-1-benzofuran-2-carboxamide::MLS001082133::SMR000713076::cid_16257621
SMILES CN(C)C(CNC(=O)c1oc2c(Cl)cccc2c1C)c1ccco1
InChI Key InChIKey=JMOGGVIWCLTQHU-UHFFFAOYSA-N
Data  1 IC50
  Tab Delimited (TSV)   2D SDfile   Computed 3D by Vconf -m prep SDfile
Find this compound or compounds like it in BindingDB:
Activity Spreadsheet -- Enzyme Inhibition Constant Data from BindingDB
Found 1 hit for monomerid = 87485
TargetTyrosine-protein kinase ABL1(Homo sapiens (Human))
The Scripps Research Institute Molecular Screening Center
Curated by PubChem BioAssay
LigandPNGBDBM87485(7-chloranyl-N-[2-(dimethylamino)-2-(furan-2-yl)eth...)
Affinity DataIC50:  5.07E+3nM. Assay description: Source (MLPCN Center Name): The Scripps Research Institute Molecular Screening Center (SRIMSC) Affiliation: The Scripps Research Institute, TSRI Assa...
In DepthDetails PCBioAssay