BDBM87550 3-[1-[1-(1-cyclohexyl-1,2,3,4-tetrazol-5-yl)propyl]piperidin-4-yl]-1H-benzimidazol-2-one::3-[1-[1-(1-cyclohexyl-5-tetrazolyl)propyl]-4-piperidinyl]-1H-benzimidazol-2-one::3-[1-[1-(1-cyclohexyltetrazol-5-yl)propyl]-4-piperidyl]-1H-benzimidazol-2-one::3-[1-[1-(1-cyclohexyltetrazol-5-yl)propyl]piperidin-4-yl]-1H-benzimidazol-2-one::MLS003315700::SMR001994835::cid_51360360
SMILES CCC(N1CCC(CC1)n1c2ccccc2[nH]c1=O)c1nnnn1C1CCCCC1
InChI Key InChIKey=DSBITVMEZIJQLK-UHFFFAOYSA-N
Data  2 IC50
  Tab Delimited (TSV)   2D SDfile   Computed 3D by Vconf -m prep SDfile
Find this compound or compounds like it in BindingDB:
Activity Spreadsheet -- Enzyme Inhibition Constant Data from BindingDB
Found 2 hits for monomerid = 87550
Target1-phosphatidylinositol 4,5-bisphosphate phosphodiesterase gamma-1 [1-999,I813T](Homo sapiens (Human))
The Scripps Research Institute Molecular Screening Center
Curated by PubChem BioAssay
LigandPNGBDBM87550(3-[1-[1-(1-cyclohexyl-1,2,3,4-tetrazol-5-yl)propyl...)
Affinity DataIC50:  1.22E+5nM. Assay description: Source (MLPCN Center Name): The Scripps Research Institute Molecular Screening Center (SRIMSC) Center Affiliation: The Scripps Research Institute Ass...
In DepthDetails PCBioAssay
Target1-phosphatidylinositol 4,5-bisphosphate phosphodiesterase beta-3(Homo sapiens (Human))
The Scripps Research Institute Molecular Screening Center
Curated by PubChem BioAssay
LigandPNGBDBM87550(3-[1-[1-(1-cyclohexyl-1,2,3,4-tetrazol-5-yl)propyl...)
Affinity DataIC50:  1.22E+5nM. Assay description: Source (MLPCN Center Name): The Scripps Research Institute Molecular Screening Center (SRIMSC) Center Affiliation: The Scripps Research Institute Ass...
In DepthDetails PCBioAssay