BDBM87594 2-(4-pyridyl)thiazolidine-4-carboxylic acid::2-Pyridin-4-yl-thiazolidine-4-carboxylic acid::2-pyridin-4-yl-1,3-thiazolidine-4-carboxylic acid::2-pyridin-4-yl-4-thiazolidinecarboxylic acid::MLS000030177::SMR000009335::cid_99985
SMILES OC(=O)C1CSC(N1)c1ccncc1
InChI Key InChIKey=IYYUJCKJSSPXQQ-UHFFFAOYSA-N
Data  2 IC50
PDB links: 1 PDB ID matches this monomer.
  Tab Delimited (TSV)   2D SDfile   Computed 3D by Vconf -m prep SDfile
Find this compound or compounds like it in BindingDB:
Activity Spreadsheet -- Enzyme Inhibition Constant Data from BindingDB
Found 2 hits for monomerid = 87594
TargetPolyadenylate-binding protein 1(Homo sapiens (Human))
Burnham Center For Chemical Genomics
Curated by PubChem BioAssay
LigandPNGBDBM87594(2-(4-pyridyl)thiazolidine-4-carboxylic acid | 2-Py...)
Affinity DataIC50: >6.60E+4nM. Assay description: Data Source: Sanford-Burnham Center for Chemical Genomics (SBCCG) Source Affiliation: Sanford-Burnham Medical Research Institute (SBMRI, San Diego, C...
In DepthDetails PCBioAssay
TargetPolyadenylate-binding protein 1(Homo sapiens (Human))
Burnham Center For Chemical Genomics
Curated by PubChem BioAssay
LigandPNGBDBM87594(2-(4-pyridyl)thiazolidine-4-carboxylic acid | 2-Py...)
Affinity DataIC50: >6.60E+4nM. Assay description: Data Source: Sanford-Burnham Center for Chemical Genomics (SBCCG) Source Affiliation: Sanford-Burnham Medical Research Institute (SBMRI, San Diego, C...
In DepthDetails PCBioAssay