BDBM87669 4-amino-3-(2,5-difluorophenyl)-2-sulfanylidene-5-thiazolecarboxylic acid methyl ester::4-amino-3-(2,5-difluorophenyl)-2-thioxo-4-thiazoline-5-carboxylic acid methyl ester::MLS000095486::SMR000031040::cid_3242071::methyl 4-amino-3-(2,5-difluorophenyl)-2-sulfanylidene-1,3-thiazole-5-carboxylate::methyl 4-amino-3-(2,5-difluorophenyl)-2-thioxo-2,3-dihydro-1,3-thiazole-5-carboxylate::methyl 4-azanyl-3-[2,5-bis(fluoranyl)phenyl]-2-sulfanylidene-1,3-thiazole-5-carboxylate
SMILES COC(=O)c1sc(=S)n(c1N)-c1cc(F)ccc1F
InChI Key InChIKey=WXSUSDCJGKGPOH-UHFFFAOYSA-N
Data  2 IC50
  Tab Delimited (TSV)   2D SDfile   Computed 3D by Vconf -m prep SDfile
Find this compound or compounds like it in BindingDB:
Activity Spreadsheet -- Enzyme Inhibition Constant Data from BindingDB
Found 2 hits for monomerid = 87669
TargetPolyadenylate-binding protein 1(Homo sapiens (Human))
Burnham Center For Chemical Genomics
Curated by PubChem BioAssay
LigandPNGBDBM87669(4-amino-3-(2,5-difluorophenyl)-2-sulfanylidene-5-t...)
Affinity DataIC50: >6.60E+4nM. Assay description: Data Source: Sanford-Burnham Center for Chemical Genomics (SBCCG) Source Affiliation: Sanford-Burnham Medical Research Institute (SBMRI, San Diego, C...
In DepthDetails PCBioAssay
TargetPolyadenylate-binding protein 1(Homo sapiens (Human))
Burnham Center For Chemical Genomics
Curated by PubChem BioAssay
LigandPNGBDBM87669(4-amino-3-(2,5-difluorophenyl)-2-sulfanylidene-5-t...)
Affinity DataIC50: >6.60E+4nM. Assay description: Data Source: Sanford-Burnham Center for Chemical Genomics (SBCCG) Source Affiliation: Sanford-Burnham Medical Research Institute (SBMRI, San Diego, C...
In DepthDetails PCBioAssay