BDBM87691 2-ethoxy-N-(6-methyl-1,3-benzothiazol-2-yl)acetamide::2-ethoxy-N-(6-methyl-1,3-benzothiazol-2-yl)ethanamide::MLS000063176::SMR000074672::cid_1729132
SMILES CCOCC(=O)Nc1nc2ccc(C)cc2s1
InChI Key InChIKey=KLYBZSFNZCMXPR-UHFFFAOYSA-N
Data  2 IC50
  Tab Delimited (TSV)   2D SDfile   Computed 3D by Vconf -m prep SDfile
Find this compound or compounds like it in BindingDB:
Activity Spreadsheet -- Enzyme Inhibition Constant Data from BindingDB
Found 2 hits for monomerid = 87691
TargetPolyadenylate-binding protein 1(Homo sapiens (Human))
Burnham Center For Chemical Genomics
Curated by PubChem BioAssay
LigandPNGBDBM87691(2-ethoxy-N-(6-methyl-1,3-benzothiazol-2-yl)acetami...)
Affinity DataIC50: >6.60E+4nM. Assay description: Data Source: Sanford-Burnham Center for Chemical Genomics (SBCCG) Source Affiliation: Sanford-Burnham Medical Research Institute (SBMRI, San Diego, C...
In DepthDetails PCBioAssay
TargetPolyadenylate-binding protein 1(Homo sapiens (Human))
Burnham Center For Chemical Genomics
Curated by PubChem BioAssay
LigandPNGBDBM87691(2-ethoxy-N-(6-methyl-1,3-benzothiazol-2-yl)acetami...)
Affinity DataIC50: >6.60E+4nM. Assay description: Data Source: Sanford-Burnham Center for Chemical Genomics (SBCCG) Source Affiliation: Sanford-Burnham Medical Research Institute (SBMRI, San Diego, C...
In DepthDetails PCBioAssay