BDBM88612 4-(3-methyl-1-piperidinyl)-5-phenyl-2-(3-pyridinyl)thieno[2,3-d]pyrimidine::4-(3-methylpiperidin-1-yl)-5-phenyl-2-pyridin-3-yl-thieno[2,3-d]pyrimidine::4-(3-methylpiperidin-1-yl)-5-phenyl-2-pyridin-3-ylthieno[2,3-d]pyrimidine::4-(3-methylpiperidino)-5-phenyl-2-(3-pyridyl)thieno[2,3-d]pyrimidine::MLS000394554::SMR000261931::cid_4834494
SMILES CC1CCCN(C1)c1nc(nc2scc(-c3ccccc3)c12)-c1cccnc1
InChI Key InChIKey=CIKJUBWQMFXUKK-UHFFFAOYSA-N
Data  1 IC50
  Tab Delimited (TSV)   2D SDfile   Computed 3D by Vconf -m prep SDfile
Find this compound or compounds like it in BindingDB:
Activity Spreadsheet -- Enzyme Inhibition Constant Data from BindingDB
Found 1 hit for monomerid = 88612
TargetMelanocortin receptor 4(Homo sapiens (Human))
The Scripps Research Institute Molecular Screening Center
Curated by PubChem BioAssay
LigandPNGBDBM88612(4-(3-methyl-1-piperidinyl)-5-phenyl-2-(3-pyridinyl...)
Affinity DataIC50: >6.46E+4nM. Assay description: Source (MLPCN Center Name): The Scripps Research Institute Molecular Screening Center (SRISMC) Center Affiliation: The Scripps Research Institute, TS...
In DepthDetails PCBioAssay