BDBM88692 3-(2-chlorophenyl)-N-[(1,2-dimethyl-5-indolyl)methyl]-5-methyl-4-isoxazolecarboxamide::3-(2-chlorophenyl)-N-[(1,2-dimethylindol-5-yl)methyl]-5-methyl-1,2-oxazole-4-carboxamide::3-(2-chlorophenyl)-N-[(1,2-dimethylindol-5-yl)methyl]-5-methyl-isoxazole-4-carboxamide::MLS000102137::SMR000017859::cid_4464849
SMILES Cc1cc2cc(CNC(=O)c3c(C)onc3-c3ccccc3Cl)ccc2n1C
InChI Key InChIKey=ILBZPQNSCUGKIV-UHFFFAOYSA-N
Data  6 EC50
  Tab Delimited (TSV)   2D SDfile   Computed 3D by Vconf -m prep SDfile
Find this compound or compounds like it in BindingDB:
Activity Spreadsheet -- Enzyme Inhibition Constant Data from BindingDB
Found 6 hits for monomerid = 88692
TargetLethal factor(Bacillus anthracis)
Nmmlsc
Curated by PubChem BioAssay
LigandPNGBDBM88692(3-(2-chlorophenyl)-N-[(1,2-dimethyl-5-indolyl)meth...)
Affinity DataEC50: >2.00E+4nM. Assay description: University of New Mexico Assay Overview: Assay Support: 1 R03 MH093184-01A1 Project Title: High-throughput multiplex microsphere screening for tox...
In DepthDetails PCBioAssay
TargetBotulinum neurotoxin type A(Clostridium botulinum (strain Hall / ATCC 3502 / N...)
Nmmlsc
Curated by PubChem BioAssay
LigandPNGBDBM88692(3-(2-chlorophenyl)-N-[(1,2-dimethyl-5-indolyl)meth...)
Affinity DataEC50:  4.20E+3nM. Assay description: University of New Mexico Assay Overview: Assay Support: 1 R03 MH093184-01A1 Project Title: High-throughput multiplex microsphere screening for tox...
In DepthDetails PCBioAssay
TargetBotulinum neurotoxin type F(Clostridium botulinum Bf)
Nmmlsc
Curated by PubChem BioAssay
LigandPNGBDBM88692(3-(2-chlorophenyl)-N-[(1,2-dimethyl-5-indolyl)meth...)
Affinity DataEC50: >2.00E+4nM. Assay description: University of New Mexico Assay Overview: Assay Support: 1 R03 MH093184-01A1 Project Title: High-throughput multiplex microsphere screening for tox...
In DepthDetails PCBioAssay
TargetBotulinum neurotoxin type A(Clostridium botulinum (strain Hall / ATCC 3502 / N...)
Nmmlsc
Curated by PubChem BioAssay
LigandPNGBDBM88692(3-(2-chlorophenyl)-N-[(1,2-dimethyl-5-indolyl)meth...)
Affinity DataEC50: >2.00E+4nM. Assay description: University of New Mexico Assay Overview: Assay Support: 1 R03 MH093184-01A1 Project Title: High-throughput multiplex microsphere screening for tox...
In DepthDetails PCBioAssay
TargetLethal factor(Bacillus anthracis)
Nmmlsc
Curated by PubChem BioAssay
LigandPNGBDBM88692(3-(2-chlorophenyl)-N-[(1,2-dimethyl-5-indolyl)meth...)
Affinity DataEC50: >2.00E+4nM. Assay description: University of New Mexico Assay Overview: Assay Support: 1 R03 MH093184-01A1 Project Title: High-throughput multiplex microsphere screening for tox...
In DepthDetails PCBioAssay
TargetBotulinum neurotoxin type F(Clostridium botulinum Bf)
Nmmlsc
Curated by PubChem BioAssay
LigandPNGBDBM88692(3-(2-chlorophenyl)-N-[(1,2-dimethyl-5-indolyl)meth...)
Affinity DataEC50: >2.00E+4nM. Assay description: University of New Mexico Assay Overview: Assay Support: 1 R03 MH093184-01A1 Project Title: High-throughput multiplex microsphere screening for tox...
In DepthDetails PCBioAssay