BDBM88704 2-[(4-chlorophenyl)sulfonyl-methyl-amino]-N-[1-(phenylmethyl)piperidin-4-yl]ethanamide::2-[(4-chlorophenyl)sulfonyl-methylamino]-N-[1-(phenylmethyl)-4-piperidinyl]acetamide::MLS002162205::N-(1-benzyl-4-piperidyl)-2-[(4-chlorophenyl)sulfonyl-methyl-amino]acetamide::N-(1-benzylpiperidin-4-yl)-2-[(4-chlorophenyl)sulfonyl-methylamino]acetamide::SMR001244615::cid_4786581
SMILES CN(CC(=O)NC1CCN(Cc2ccccc2)CC1)S(=O)(=O)c1ccc(Cl)cc1
InChI Key InChIKey=HZTPYIISKLDEAS-UHFFFAOYSA-N
Data  2 EC50
  Tab Delimited (TSV)   2D SDfile   Computed 3D by Vconf -m prep SDfile
Find this compound or compounds like it in BindingDB:
Activity Spreadsheet -- Enzyme Inhibition Constant Data from BindingDB
Found 2 hits for monomerid = 88704
TargetBotulinum neurotoxin type A(Clostridium botulinum (strain Hall / ATCC 3502 / N...)
Nmmlsc
Curated by PubChem BioAssay
LigandPNGBDBM88704(2-[(4-chlorophenyl)sulfonyl-methyl-amino]-N-[1-(ph...)
Affinity DataEC50: >2.00E+4nM. Assay description: University of New Mexico Assay Overview: Assay Support: 1 R03 MH093184-01A1 Project Title: High-throughput multiplex microsphere screening for tox...
In DepthDetails PCBioAssay
TargetLethal factor(Bacillus anthracis)
Nmmlsc
Curated by PubChem BioAssay
LigandPNGBDBM88704(2-[(4-chlorophenyl)sulfonyl-methyl-amino]-N-[1-(ph...)
Affinity DataEC50: >2.00E+4nM. Assay description: University of New Mexico Assay Overview: Assay Support: 1 R03 MH093184-01A1 Project Title: High-throughput multiplex microsphere screening for tox...
In DepthDetails PCBioAssay