BDBM88715 6-bromanyl-2-(4-fluorophenyl)-3-[(2-methoxyphenyl)methyl]-5,7-dimethyl-imidazo[1,2-a]pyridine::6-bromo-2-(4-fluorophenyl)-3-[(2-methoxyphenyl)methyl]-5,7-dimethylimidazo[1,2-a]pyridine::6-bromo-2-(4-fluorophenyl)-5,7-dimethyl-3-o-anisyl-imidazo[1,2-a]pyridine::MLS003468646::SMR002134621::cid_53299791
SMILES COc1ccccc1Cc1c(nc2cc(C)c(Br)c(C)n12)-c1ccc(F)cc1
InChI Key InChIKey=LETMCSFLVGJNOO-UHFFFAOYSA-N
Data  2 EC50
  Tab Delimited (TSV)   2D SDfile   Computed 3D by Vconf -m prep SDfile
Find this compound or compounds like it in BindingDB:
Activity Spreadsheet -- Enzyme Inhibition Constant Data from BindingDB
Found 2 hits for monomerid = 88715
TargetBotulinum neurotoxin type A(Clostridium botulinum (strain Hall / ATCC 3502 / N...)
Nmmlsc
Curated by PubChem BioAssay
LigandPNGBDBM88715(6-bromanyl-2-(4-fluorophenyl)-3-[(2-methoxyphenyl)...)
Affinity DataEC50: >2.00E+4nM. Assay description: University of New Mexico Assay Overview: Assay Support: 1 R03 MH093184-01A1 Project Title: High-throughput multiplex microsphere screening for tox...
In DepthDetails PCBioAssay
TargetLethal factor(Bacillus anthracis)
Nmmlsc
Curated by PubChem BioAssay
LigandPNGBDBM88715(6-bromanyl-2-(4-fluorophenyl)-3-[(2-methoxyphenyl)...)
Affinity DataEC50: >2.00E+4nM. Assay description: University of New Mexico Assay Overview: Assay Support: 1 R03 MH093184-01A1 Project Title: High-throughput multiplex microsphere screening for tox...
In DepthDetails PCBioAssay