BDBM88742 MLS000700471::N'-[(4-oxo-4H-chromen-3-yl)methylene]-1-benzofuran-2-carbohydrazide::N-[(E)-(4-ketochromen-3-yl)methyleneamino]coumarilamide::N-[(E)-(4-oxidanylidenechromen-3-yl)methylideneamino]-1-benzofuran-2-carboxamide::N-[(E)-(4-oxo-1-benzopyran-3-yl)methylideneamino]-2-benzofurancarboxamide::N-[(E)-(4-oxochromen-3-yl)methylideneamino]-1-benzofuran-2-carboxamide::SMR000227312::cid_9557333
SMILES O=C(N\N=C\c1coc2ccccc2c1=O)c1cc2ccccc2o1
InChI Key InChIKey=ACEINHAVRVABLI-KEBDBYFISA-N
Data  4 IC50
  Tab Delimited (TSV)   2D SDfile   Computed 3D by Vconf -m prep SDfile
Find this compound or compounds like it in BindingDB:
Activity Spreadsheet -- Enzyme Inhibition Constant Data from BindingDB
Found 4 hits for monomerid = 88742
TargetTyrosine-protein phosphatase non-receptor type 5(Homo sapiens (Human))
Burnham Center For Chemical Genomics
Curated by PubChem BioAssay
LigandPNGBDBM88742(MLS000700471 | N'-[(4-oxo-4H-chromen-3-yl)meth...)
Affinity DataIC50:  3.58E+4nM. Assay description: Data Source: Sanford-Burnham Center for Chemical Genomics (SBCCG) Source Affiliation: Sanford-Burnham Medical Research Institute (SBMRI, San Diego, C...
In DepthDetails PCBioAssay
TargetTyrosine-protein phosphatase non-receptor type 5(Homo sapiens (Human))
Burnham Center For Chemical Genomics
Curated by PubChem BioAssay
LigandPNGBDBM88742(MLS000700471 | N'-[(4-oxo-4H-chromen-3-yl)meth...)
Affinity DataIC50: >8.00E+4nM. Assay description: Data Source: Sanford-Burnham Center for Chemical Genomics (SBCCG) Source Affiliation: Sanford-Burnham Medical Research Institute (SBMRI, San Diego, C...
In DepthDetails PCBioAssay
TargetTyrosine-protein phosphatase non-receptor type 11(Homo sapiens (Human))
Burnham Center For Chemical Genomics
Curated by PubChem BioAssay
LigandPNGBDBM88742(MLS000700471 | N'-[(4-oxo-4H-chromen-3-yl)meth...)
Affinity DataIC50:  3.34E+4nM. Assay description: Data Source: Sanford-Burnham Center for Chemical Genomics (SBCCG) Source Affiliation: Sanford-Burnham Medical Research Institute (SBMRI, San Diego, C...
In DepthDetails PCBioAssay
TargetDual specificity protein phosphatase 3(Homo sapiens (Human))
Burnham Center For Chemical Genomics
Curated by PubChem BioAssay
LigandPNGBDBM88742(MLS000700471 | N'-[(4-oxo-4H-chromen-3-yl)meth...)
Affinity DataIC50:  1.41E+4nM. Assay description: Data Source: Sanford-Burnham Center for Chemical Genomics (SBCCG) Source Affiliation: Sanford-Burnham Medical Research Institute (SBMRI, San Diego, C...
In DepthDetails PCBioAssay