BDBM88746 2-oxidanyl-N-[(E)-[4-(2-oxidanylidene-2-phenylazanyl-ethoxy)phenyl]methylideneamino]benzamide::MLS000856605::N-[(E)-[4-(2-anilino-2-keto-ethoxy)benzylidene]amino]-2-hydroxy-benzamide::N-[(E)-[4-(2-anilino-2-oxoethoxy)phenyl]methylideneamino]-2-hydroxybenzamide::SMR000274962::cid_9564312
SMILES Oc1ccccc1C(=O)N\N=C\c1ccc(OCC(=O)Nc2ccccc2)cc1
InChI Key InChIKey=CCINUCVYCWIIPV-OEAKJJBVSA-N
Data  7 IC50
  Tab Delimited (TSV)   2D SDfile   Computed 3D by Vconf -m prep SDfile
Find this compound or compounds like it in BindingDB:
Activity Spreadsheet -- Enzyme Inhibition Constant Data from BindingDB
Found 7 hits for monomerid = 88746
TargetTyrosine-protein phosphatase non-receptor type 5(Homo sapiens (Human))
Burnham Center For Chemical Genomics
Curated by PubChem BioAssay
LigandPNGBDBM88746(2-oxidanyl-N-[(E)-[4-(2-oxidanylidene-2-phenylazan...)
Affinity DataIC50:  1.17E+4nM. Assay description: Data Source: Sanford-Burnham Center for Chemical Genomics (SBCCG) Source Affiliation: Sanford-Burnham Medical Research Institute (SBMRI, San Diego, C...
In DepthDetails PCBioAssay
TargetDual specificity protein phosphatase 3(Homo sapiens (Human))
Burnham Center For Chemical Genomics
Curated by PubChem BioAssay
LigandPNGBDBM88746(2-oxidanyl-N-[(E)-[4-(2-oxidanylidene-2-phenylazan...)
Affinity DataIC50:  3.88E+3nM. Assay description: Data Source: Sanford-Burnham Center for Chemical Genomics (SBCCG) Source Affiliation: Sanford-Burnham Medical Research Institute (SBMRI, San Diego, C...
In DepthDetails PCBioAssay
TargetTyrosine-protein phosphatase non-receptor type 11(Homo sapiens (Human))
Burnham Center For Chemical Genomics
Curated by PubChem BioAssay
LigandPNGBDBM88746(2-oxidanyl-N-[(E)-[4-(2-oxidanylidene-2-phenylazan...)
Affinity DataIC50:  4.22E+3nM. Assay description: Data Source: Sanford-Burnham Center for Chemical Genomics (SBCCG) Source Affiliation: Sanford-Burnham Medical Research Institute (SBMRI, San Diego, C...
In DepthDetails PCBioAssay
TargetLow molecular weight phosphotyrosine protein phosphatase(Homo sapiens (Human))
Burnham Center For Chemical Genomics
Curated by PubChem BioAssay
LigandPNGBDBM88746(2-oxidanyl-N-[(E)-[4-(2-oxidanylidene-2-phenylazan...)
Affinity DataIC50:  1.64E+4nM
In DepthDetails PCBioAssay
TargetTyrosine-protein phosphatase non-receptor type 5(Homo sapiens (Human))
Burnham Center For Chemical Genomics
Curated by PubChem BioAssay
LigandPNGBDBM88746(2-oxidanyl-N-[(E)-[4-(2-oxidanylidene-2-phenylazan...)
Affinity DataIC50:  2.36E+4nM. Assay description: Data Source: Sanford-Burnham Center for Chemical Genomics (SBCCG) Source Affiliation: Sanford-Burnham Medical Research Institute (SBMRI, San Diego, C...
In DepthDetails PCBioAssay
TargetTyrosine-protein phosphatase non-receptor type 22(Homo sapiens (Human))
Burnham Center For Chemical Genomics
Curated by PubChem BioAssay
LigandPNGBDBM88746(2-oxidanyl-N-[(E)-[4-(2-oxidanylidene-2-phenylazan...)
Affinity DataIC50: >1.00E+5nM. Assay description: Data Source: Sanford-Burnham Center for Chemical Genomics (SBCCG) Source Affiliation: Sanford-Burnham Medical Research Institute (SBMRI, San Diego, C...
In DepthDetails PCBioAssay
TargetLow molecular weight phosphotyrosine protein phosphatase(Homo sapiens (Human))
Burnham Center For Chemical Genomics
Curated by PubChem BioAssay
LigandPNGBDBM88746(2-oxidanyl-N-[(E)-[4-(2-oxidanylidene-2-phenylazan...)
Affinity DataIC50:  3.99E+4nM
In DepthDetails PCBioAssay