BDBM89058 MLS-0454727.0001::[(Z)-[amino-(2,4-difluorophenyl)methylidene]amino] benzoate::[(Z)-[azanyl-[2,4-bis(fluoranyl)phenyl]methylidene]amino] benzoate::benzoic acid [(Z)-[amino-(2,4-difluorophenyl)methylene]amino] ester::benzoic acid [(Z)-[amino-(2,4-difluorophenyl)methylidene]amino] ester::cid_9584565
SMILES NC(=NOC(=O)c1ccccc1)c1ccc(F)cc1F
InChI Key InChIKey=JXVKJKQHDWWWMY-UHFFFAOYSA-N
Data  3 IC50
  Tab Delimited (TSV)   2D SDfile   Computed 3D by Vconf -m prep SDfile
Find this compound or compounds like it in BindingDB:
Activity Spreadsheet -- Enzyme Inhibition Constant Data from BindingDB
Found 3 hits for monomerid = 89058
TargetMitochondrial import inner membrane translocase subunit TIM23(Saccharomyces cerevisiae S288c)
Burnham Center For Chemical Genomics
Curated by PubChem BioAssay
LigandPNGBDBM89058(MLS-0454727.0001 | [(Z)-[amino-(2,4-difluorophenyl...)
Affinity DataIC50:  5.79E+4nM. Assay description: Data Source: Sanford-Burnham Center for Chemical Genomics (SBCCG) Source Affiliation: Sanford-Burnham Medical Research Institute(SBMRI, San Diego, CA...
In DepthDetails PCBioAssay
TargetMitochondrial import inner membrane translocase subunit TIM10(Saccharomyces cerevisiae S288c)
Burnham Center For Chemical Genomics
Curated by PubChem BioAssay
LigandPNGBDBM89058(MLS-0454727.0001 | [(Z)-[amino-(2,4-difluorophenyl...)
Affinity DataIC50:  1.67E+4nM. Assay description: Data Source: Sanford-Burnham Center for Chemical Genomics (SBCCG) Source Affiliation: Sanford-Burnham Medical Research Institute(SBMRI, San Diego, CA...
In DepthDetails PCBioAssay
TargetMitochondrial import inner membrane translocase subunit TIM10(Saccharomyces cerevisiae S288c)
Burnham Center For Chemical Genomics
Curated by PubChem BioAssay
LigandPNGBDBM89058(MLS-0454727.0001 | [(Z)-[amino-(2,4-difluorophenyl...)
Affinity DataIC50:  6.71E+3nM. Assay description: Data Source: Sanford-Burnham Center for Chemical Genomics (SBCCG) Source Affiliation: Sanford-Burnham Medical Research Institute(SBMRI, San Diego, CA...
In DepthDetails PCBioAssay