BDBM89113 2-[(7-methoxy-4-methyl-quinolin-2-yl)sulfanylmethyl]-7-methyl-pyrido[1,2-a]pyrimidin-4-one::2-[(7-methoxy-4-methylquinolin-2-yl)sulfanylmethyl]-7-methylpyrido[1,2-a]pyrimidin-4-one::2-[[(7-methoxy-4-methyl-2-quinolinyl)thio]methyl]-7-methyl-4-pyrido[1,2-a]pyrimidinone::2-[[(7-methoxy-4-methyl-2-quinolyl)thio]methyl]-7-methyl-pyrido[1,2-a]pyrimidin-4-one::MLS-0463380.0001::cid_4783990
SMILES COc1ccc2c(C)cc(SCc3cc(=O)n4cc(C)ccc4n3)nc2c1
InChI Key InChIKey=KYJWXSJNWXPDIN-UHFFFAOYSA-N
Data  3 IC50
  Tab Delimited (TSV)   2D SDfile   Computed 3D by Vconf -m prep SDfile
Find this compound or compounds like it in BindingDB:
Activity Spreadsheet -- Enzyme Inhibition Constant Data from BindingDB
Found 3 hits for monomerid = 89113
TargetMitochondrial import inner membrane translocase subunit TIM23(Saccharomyces cerevisiae S288c)
Burnham Center For Chemical Genomics
Curated by PubChem BioAssay
LigandPNGBDBM89113(2-[(7-methoxy-4-methyl-quinolin-2-yl)sulfanylmethy...)
Affinity DataIC50: >9.90E+4nM. Assay description: Data Source: Sanford-Burnham Center for Chemical Genomics (SBCCG) Source Affiliation: Sanford-Burnham Medical Research Institute(SBMRI, San Diego, CA...
In DepthDetails PCBioAssay
TargetMitochondrial import inner membrane translocase subunit TIM10(Saccharomyces cerevisiae S288c)
Burnham Center For Chemical Genomics
Curated by PubChem BioAssay
LigandPNGBDBM89113(2-[(7-methoxy-4-methyl-quinolin-2-yl)sulfanylmethy...)
Affinity DataIC50:  6.65E+4nM. Assay description: Data Source: Sanford-Burnham Center for Chemical Genomics (SBCCG) Source Affiliation: Sanford-Burnham Medical Research Institute(SBMRI, San Diego, CA...
In DepthDetails PCBioAssay
TargetMitochondrial import inner membrane translocase subunit TIM10(Saccharomyces cerevisiae S288c)
Burnham Center For Chemical Genomics
Curated by PubChem BioAssay
LigandPNGBDBM89113(2-[(7-methoxy-4-methyl-quinolin-2-yl)sulfanylmethy...)
Affinity DataIC50:  8.01E+4nM. Assay description: Data Source: Sanford-Burnham Center for Chemical Genomics (SBCCG) Source Affiliation: Sanford-Burnham Medical Research Institute(SBMRI, San Diego, CA...
In DepthDetails PCBioAssay