BDBM89128 3-amino-6-methyl-N-(4-methyl-1,3-thiazol-2-yl)-7,8-dihydro-5H-thieno[2,3-b][1,6]naphthyridine-2-carboxamide::3-amino-6-methyl-N-(4-methyl-2-thiazolyl)-7,8-dihydro-5H-thieno[2,3-b][1,6]naphthyridine-2-carboxamide::3-amino-6-methyl-N-(4-methylthiazol-2-yl)-7,8-dihydro-5H-thieno[2,3-b][1,6]naphthyridine-2-carboxamide::3-azanyl-6-methyl-N-(4-methyl-1,3-thiazol-2-yl)-7,8-dihydro-5H-thieno[2,3-b][1,6]naphthyridine-2-carboxamide::MLS-0463407.0001::cid_11838614
SMILES CN1CCc2nc3sc(C(=O)Nc4nc(C)cs4)c(N)c3cc2C1
InChI Key InChIKey=RLCPHRFZIIZPBC-UHFFFAOYSA-N
Data  3 IC50
  Tab Delimited (TSV)   2D SDfile   Computed 3D by Vconf -m prep SDfile
Find this compound or compounds like it in BindingDB:
Activity Spreadsheet -- Enzyme Inhibition Constant Data from BindingDB
Found 3 hits for monomerid = 89128
TargetMitochondrial import inner membrane translocase subunit TIM23(Saccharomyces cerevisiae S288c)
Burnham Center For Chemical Genomics
Curated by PubChem BioAssay
LigandPNGBDBM89128(3-amino-6-methyl-N-(4-methyl-1,3-thiazol-2-yl)-7,8...)
Affinity DataIC50: >9.90E+4nM. Assay description: Data Source: Sanford-Burnham Center for Chemical Genomics (SBCCG) Source Affiliation: Sanford-Burnham Medical Research Institute(SBMRI, San Diego, CA...
In DepthDetails PCBioAssay
TargetMitochondrial import inner membrane translocase subunit TIM10(Saccharomyces cerevisiae S288c)
Burnham Center For Chemical Genomics
Curated by PubChem BioAssay
LigandPNGBDBM89128(3-amino-6-methyl-N-(4-methyl-1,3-thiazol-2-yl)-7,8...)
Affinity DataIC50:  6.85E+4nM. Assay description: Data Source: Sanford-Burnham Center for Chemical Genomics (SBCCG) Source Affiliation: Sanford-Burnham Medical Research Institute(SBMRI, San Diego, CA...
In DepthDetails PCBioAssay
TargetMitochondrial import inner membrane translocase subunit TIM10(Saccharomyces cerevisiae S288c)
Burnham Center For Chemical Genomics
Curated by PubChem BioAssay
LigandPNGBDBM89128(3-amino-6-methyl-N-(4-methyl-1,3-thiazol-2-yl)-7,8...)
Affinity DataIC50: >9.90E+4nM. Assay description: Data Source: Sanford-Burnham Center for Chemical Genomics (SBCCG) Source Affiliation: Sanford-Burnham Medical Research Institute(SBMRI, San Diego, CA...
In DepthDetails PCBioAssay