BDBM89131 3,4-bis(fluoranyl)-N-[(2-methyl-1H-indol-5-yl)methyl]benzamide::3,4-difluoro-N-[(2-methyl-1H-indol-5-yl)methyl]benzamide::MLS-0463409.0001::cid_5096427
SMILES Cc1cc2cc(CNC(=O)c3ccc(F)c(F)c3)ccc2[nH]1
InChI Key InChIKey=UUOHLUTZNVZCSU-UHFFFAOYSA-N
Data  3 IC50
  Tab Delimited (TSV)   2D SDfile   Computed 3D by Vconf -m prep SDfile
Find this compound or compounds like it in BindingDB:
Activity Spreadsheet -- Enzyme Inhibition Constant Data from BindingDB
Found 3 hits for monomerid = 89131
TargetMitochondrial import inner membrane translocase subunit TIM23(Saccharomyces cerevisiae S288c)
Burnham Center For Chemical Genomics
Curated by PubChem BioAssay
LigandPNGBDBM89131(3,4-bis(fluoranyl)-N-[(2-methyl-1H-indol-5-yl)meth...)
Affinity DataIC50: >9.90E+4nM. Assay description: Data Source: Sanford-Burnham Center for Chemical Genomics (SBCCG) Source Affiliation: Sanford-Burnham Medical Research Institute(SBMRI, San Diego, CA...
In DepthDetails PCBioAssay
TargetMitochondrial import inner membrane translocase subunit TIM10(Saccharomyces cerevisiae S288c)
Burnham Center For Chemical Genomics
Curated by PubChem BioAssay
LigandPNGBDBM89131(3,4-bis(fluoranyl)-N-[(2-methyl-1H-indol-5-yl)meth...)
Affinity DataIC50:  8.68E+4nM. Assay description: Data Source: Sanford-Burnham Center for Chemical Genomics (SBCCG) Source Affiliation: Sanford-Burnham Medical Research Institute(SBMRI, San Diego, CA...
In DepthDetails PCBioAssay
TargetMitochondrial import inner membrane translocase subunit TIM10(Saccharomyces cerevisiae S288c)
Burnham Center For Chemical Genomics
Curated by PubChem BioAssay
LigandPNGBDBM89131(3,4-bis(fluoranyl)-N-[(2-methyl-1H-indol-5-yl)meth...)
Affinity DataIC50:  8.26E+4nM. Assay description: Data Source: Sanford-Burnham Center for Chemical Genomics (SBCCG) Source Affiliation: Sanford-Burnham Medical Research Institute(SBMRI, San Diego, CA...
In DepthDetails PCBioAssay