BDBM89203 2-[[4-[(2E)-2-[(5-chloranyl-3-methyl-1-phenyl-pyrazol-4-yl)methylidene]hydrazinyl]-3-nitro-phenyl]sulfonylamino]benzoic acid::2-[[4-[(2E)-2-[(5-chloro-3-methyl-1-phenyl-4-pyrazolyl)methylidene]hydrazinyl]-3-nitrophenyl]sulfonylamino]benzoic acid::2-[[4-[(2E)-2-[(5-chloro-3-methyl-1-phenylpyrazol-4-yl)methylidene]hydrazinyl]-3-nitrophenyl]sulfonylamino]benzoic acid::2-[[4-[(N'E)-N'-[(5-chloro-3-methyl-1-phenyl-pyrazol-4-yl)methylene]hydrazino]-3-nitro-phenyl]sulfonylamino]benzoic acid::MLS001332784::SMR000152340::cid_9642771
SMILES Cc1nn(c(Cl)c1[CH-]\N=[NH+]\c1ccc(cc1[N+]([O-])=O)S(=O)(=O)Nc1ccccc1C(O)=O)-c1ccccc1
InChI Key InChIKey=KNVJXKQUXZOOOS-CYYJNZCTSA-O
Data  1 IC50
  Tab Delimited (TSV)   2D SDfile   Computed 3D by Vconf -m prep SDfile
Find this compound or compounds like it in BindingDB:
Activity Spreadsheet -- Enzyme Inhibition Constant Data from BindingDB
Found 1 hit for monomerid = 89203
TargetDNA (cytosine-5)-methyltransferase 1(Homo sapiens (Human))
Burnham Center For Chemical Genomics
Curated by PubChem BioAssay
LigandPNGBDBM89203(2-[[4-[(2E)-2-[(5-chloranyl-3-methyl-1-phenyl-pyra...)
Affinity DataIC50:  4.29E+3nM. Assay description: Data Source: Sanford-Burnham Center for Chemical Genomics (SBCCG) Source Affiliation: Sanford-Burnham Medical Research Institute (SBMRI, San Diego, C...
In DepthDetails PCBioAssay