BDBM89220 4-(1-aziridinyl)naphthalene-1,2-dione::4-(aziridin-1-yl)naphthalene-1,2-dione::4-Ethyleniminonaphthoquinone-1,2::4-ethylenimino-1,2-naphthoquinone::MLS002920479::SMR001798069::cid_9922
SMILES O=C1C=C(N2CC2)c2ccccc2C1=O
InChI Key InChIKey=KWBYKWLHLZKMKF-UHFFFAOYSA-N
Data  1 IC50
  Tab Delimited (TSV)   2D SDfile   Computed 3D by Vconf -m prep SDfile
Find this compound or compounds like it in BindingDB:
Activity Spreadsheet -- Enzyme Inhibition Constant Data from BindingDB
Found 1 hit for monomerid = 89220
TargetDNA (cytosine-5)-methyltransferase 1(Homo sapiens (Human))
Burnham Center For Chemical Genomics
Curated by PubChem BioAssay
LigandPNGBDBM89220(4-(1-aziridinyl)naphthalene-1,2-dione | 4-(aziridi...)
Affinity DataIC50:  1.87E+3nM. Assay description: Data Source: Sanford-Burnham Center for Chemical Genomics (SBCCG) Source Affiliation: Sanford-Burnham Medical Research Institute (SBMRI, San Diego, C...
In DepthDetails PCBioAssay