BDBM89257 (5,6-dimethylthieno[2,3-d]pyrimidin-4-yl)-(2-methyl-2-morpholino-propyl)amine::5,6-dimethyl-N-(2-methyl-2-morpholin-4-yl-propyl)thieno[2,3-d]pyrimidin-4-amine::5,6-dimethyl-N-(2-methyl-2-morpholin-4-ylpropyl)thieno[2,3-d]pyrimidin-4-amine::5,6-dimethyl-N-[2-methyl-2-(4-morpholinyl)propyl]-4-thieno[2,3-d]pyrimidinamine::MLS000567264::SMR000154039::cid_2571309
SMILES Cc1sc2ncnc(NCC(C)(C)N3CCOCC3)c2c1C
InChI Key InChIKey=KQXYFFACRYKBSU-UHFFFAOYSA-N
Data  2 IC50
  Tab Delimited (TSV)   2D SDfile   Computed 3D by Vconf -m prep SDfile
Find this compound or compounds like it in BindingDB:
Activity Spreadsheet -- Enzyme Inhibition Constant Data from BindingDB
Found 2 hits for monomerid = 89257
TargetProtein Wnt-3a(Mus musculus)
Burnham Center For Chemical Genomics
Curated by PubChem BioAssay
LigandPNGBDBM89257((5,6-dimethylthieno[2,3-d]pyrimidin-4-yl)-(2-methy...)
Affinity DataIC50:  942nM
In DepthDetails PCBioAssay
TargetZinc finger protein GLI1(Mus musculus)
Burnham Center For Chemical Genomics
Curated by PubChem BioAssay
LigandPNGBDBM89257((5,6-dimethylthieno[2,3-d]pyrimidin-4-yl)-(2-methy...)
Affinity DataIC50:  3.85E+3nM. Assay description: Data Source: Sanford-Burnham Center for Chemical Genomics (SBCCG) Source Affiliation: Sanford-Burnham Medical Research Institute (SBMRI, San Diego, C...
In DepthDetails PCBioAssay