BDBM89497 3-(2,5-dimethoxyphenyl)-2-isoxazoline-5-carboxylic acid::3-(2,5-dimethoxyphenyl)-4,5-dihydro-1,2-oxazole-5-carboxylic acid::3-(2,5-dimethoxyphenyl)-4,5-dihydroisoxazole-5-carboxylic acid::MLS-0466811.0001::cid_25220803
SMILES COc1ccc(OC)c(c1)C1=NOC(C1)C(O)=O
InChI Key InChIKey=TVKIPMFFMHSWBP-UHFFFAOYSA-N
Data  2 EC50
  Tab Delimited (TSV)   2D SDfile   Computed 3D by Vconf -m prep SDfile
Find this compound or compounds like it in BindingDB:
Activity Spreadsheet -- Enzyme Inhibition Constant Data from BindingDB
Found 2 hits for monomerid = 89497
TargetCaspase-9(Homo sapiens (Human))
Burnham Center For Chemical Genomics
Curated by PubChem BioAssay
LigandPNGBDBM89497(3-(2,5-dimethoxyphenyl)-2-isoxazoline-5-carboxylic...)
Affinity DataEC50: >1.00E+5nM. Assay description: Data Source: Sanford-Burnham Center for Chemical Genomics (SBCCG) Source Affiliation: Sanford-Burnham Medical Research Institute (SBIMR, San Diego, C...
In DepthDetails PCBioAssay
TargetApoptotic protease-activating factor 1(Homo sapiens (Human))
Burnham Center For Chemical Genomics
Curated by PubChem BioAssay
LigandPNGBDBM89497(3-(2,5-dimethoxyphenyl)-2-isoxazoline-5-carboxylic...)
Affinity DataEC50: >1.00E+5nM. Assay description: Data Source: Sanford-Burnham Center for Chemical Genomics (SBCCG) Source Affiliation: Sanford-Burnham Medical Research Institute (SBIMR, San Diego, C...
In DepthDetails PCBioAssay