BDBM89603 (3,5-dimethyl-1,2-oxazol-4-yl)methyl 2,5-dimethyl-1-phenyl-pyrrole-3-carboxylate::(3,5-dimethyl-1,2-oxazol-4-yl)methyl 2,5-dimethyl-1-phenylpyrrole-3-carboxylate::2,5-dimethyl-1-phenyl-3-pyrrolecarboxylic acid (3,5-dimethyl-4-isoxazolyl)methyl ester::2,5-dimethyl-1-phenyl-pyrrole-3-carboxylic acid (3,5-dimethylisoxazol-4-yl)methyl ester::MLS000098702::SMR000063746::cid_2124287
SMILES Cc1cc(C(=O)OCc2c(C)noc2C)c(C)n1-c1ccccc1
InChI Key InChIKey=JGZTYAPTVLIRIO-UHFFFAOYSA-N
Data  1 IC50  1 EC50
  Tab Delimited (TSV)   2D SDfile   Computed 3D by Vconf -m prep SDfile
Find this compound or compounds like it in BindingDB:
Activity Spreadsheet -- Enzyme Inhibition Constant Data from BindingDB
Found 2 hits for monomerid = 89603
TargetCorticotropin-releasing factor-binding protein(Homo sapiens (Human))
Burnham Center For Chemical Genomics
Curated by PubChem BioAssay
LigandPNGBDBM89603((3,5-dimethyl-1,2-oxazol-4-yl)methyl 2,5-dimethyl-...)
Affinity DataIC50:  2.00E+4nM
In DepthDetails PCBioAssay
TargetCorticotropin-releasing factor-binding protein(Homo sapiens (Human))
Burnham Center For Chemical Genomics
Curated by PubChem BioAssay
LigandPNGBDBM89603((3,5-dimethyl-1,2-oxazol-4-yl)methyl 2,5-dimethyl-...)
Affinity DataEC50: >5.30E+4nM. Assay description: Data Source: Sanford-Burnham Center for Chemical Genomics (SBCCG) Source Affiliation: Sanford-Burnham Medical Research Institute (SBMRI, San Diego, C...
In DepthDetails PCBioAssay