BDBM89684 2-[[3-(4-ethoxyphenyl)-4-oxidanylidene-5H-pyrimido[5,4-b]indol-2-yl]sulfanyl]-N-(furan-2-ylmethyl)ethanamide::2-[[3-(4-ethoxyphenyl)-4-oxo-5H-pyrimido[5,4-b]indol-2-yl]sulfanyl]-N-(furan-2-ylmethyl)acetamide::2-[[3-(4-ethoxyphenyl)-4-oxo-5H-pyrimido[5,4-b]indol-2-yl]thio]-N-(2-furanylmethyl)acetamide::MLS000086614::N-(2-furfuryl)-2-[(4-keto-3-p-phenetyl-5H-pyrimid[5,4-b]indol-2-yl)thio]acetamide::SMR000016035::cid_2156185
SMILES CCOc1ccc(cc1)-n1c(SCC(=O)NCc2ccco2)nc2c3ccccc3[nH]c2c1=O
InChI Key InChIKey=COVIULGLOZCWLQ-UHFFFAOYSA-N
Data  1 IC50  1 EC50
  Tab Delimited (TSV)   2D SDfile   Computed 3D by Vconf -m prep SDfile
Find this compound or compounds like it in BindingDB:
Activity Spreadsheet -- Enzyme Inhibition Constant Data from BindingDB
Found 2 hits for monomerid = 89684
TargetCorticotropin-releasing factor-binding protein(Homo sapiens (Human))
Burnham Center For Chemical Genomics
Curated by PubChem BioAssay
LigandPNGBDBM89684(2-[[3-(4-ethoxyphenyl)-4-oxidanylidene-5H-pyrimido...)
Affinity DataIC50:  1.50E+4nM
In DepthDetails PCBioAssay
TargetCorticotropin-releasing factor-binding protein(Homo sapiens (Human))
Burnham Center For Chemical Genomics
Curated by PubChem BioAssay
LigandPNGBDBM89684(2-[[3-(4-ethoxyphenyl)-4-oxidanylidene-5H-pyrimido...)
Affinity DataEC50: >5.30E+4nM. Assay description: Data Source: Sanford-Burnham Center for Chemical Genomics (SBCCG) Source Affiliation: Sanford-Burnham Medical Research Institute (SBMRI, San Diego, C...
In DepthDetails PCBioAssay