BDBM91502 4-nitro-N-[(1-oxopentylhydrazo)-sulfanylidenemethyl]benzamide::4-nitro-N-[(pentanoylamino)carbamothioyl]benzamide::4-nitro-N-[(valerylamino)thiocarbamoyl]benzamide::MLS000712857::SMR000282624::cid_3138340
SMILES CCCCC(=O)NNC(=S)NC(=O)c1ccc(cc1)[N+]([O-])=O
InChI Key InChIKey=DZNNYKSTICIHAR-UHFFFAOYSA-N
Data  1 EC50
  Tab Delimited (TSV)   2D SDfile   Computed 3D by Vconf -m prep SDfile
Find this compound or compounds like it in BindingDB:
Activity Spreadsheet -- Enzyme Inhibition Constant Data from BindingDB
Found 1 hit for monomerid = 91502
TargetMitochondrial peptide methionine sulfoxide reductase(Bos taurus)
The Scripps Research Institute Molecular Screening Center
Curated by PubChem BioAssay
LigandPNGBDBM91502(4-nitro-N-[(1-oxopentylhydrazo)-sulfanylidenemethy...)
Affinity DataEC50: >1.04E+5nM. Assay description: Source (MLPCN Center Name): The Scripps Research Institute Molecular Screening Center (SRIMSC) Affiliation: The Scripps Research Institute, TSRI Assa...
In DepthDetails PCBioAssay