BDBM91512 2,3-dimethylbenzo[g]quinoxaline-5,10-dione::2,3-dimethylbenzo[g]quinoxaline-5,10-quinone::Benzo[g]quinoxaline-5,10-dione, 5,10-dihydro-2,3-dimethyl-::MLS002702968::SMR001566782::cid_353644
SMILES Cc1nc2C(=O)c3ccccc3C(=O)c2nc1C
InChI Key InChIKey=QWAGSSCSLRFGSL-UHFFFAOYSA-N
Data  1 EC50
  Tab Delimited (TSV)   2D SDfile   Computed 3D by Vconf -m prep SDfile
Find this compound or compounds like it in BindingDB:
Activity Spreadsheet -- Enzyme Inhibition Constant Data from BindingDB
Found 1 hit for monomerid = 91512
TargetMitochondrial peptide methionine sulfoxide reductase(Bos taurus)
The Scripps Research Institute Molecular Screening Center
Curated by PubChem BioAssay
LigandPNGBDBM91512(2,3-dimethylbenzo[g]quinoxaline-5,10-dione | 2,3-d...)
Affinity DataEC50:  9.56E+4nM. Assay description: Source (MLPCN Center Name): The Scripps Research Institute Molecular Screening Center (SRIMSC) Affiliation: The Scripps Research Institute, TSRI Assa...
Ligand InfoPC cidPC sid
In DepthDetails PCBioAssay