BDBM9180 (3R,3aS,6aR)-hexahydrofuro[2,3-b]furan-3-yl N-[(2S,3R)-4-[(cyclohexyloxy)(4-hydroxybenzene)sulfonamido]-3-hydroxy-1-phenylbutan-2-yl]carbamate::N-alkoxysulfonamide analog 21::N-alkoxysulfonamide analog entry t
SMILES [H][C@@]12CCO[C@]1([H])OC[C@@H]2OC(=O)N[C@@H](Cc1ccccc1)[C@H](O)CN(OC1CCCCC1)S(=O)(=O)c1ccc(O)cc1
InChI Key InChIKey=MXZUOYJAKKUHJB-AJIIGFCHSA-N
Data  1 KI  1 IC50
  Tab Delimited (TSV)   2D SDfile   Computed 3D by Vconf -m prep SDfile
Find this compound or compounds like it in BindingDB:
Activity Spreadsheet -- Enzyme Inhibition Constant Data from BindingDB
Found 1 hit for monomerid = 9180
TargetDimer of Gag-Pol polyprotein [501-599,Q508K,L534I,L564I,C568A,C596A](Human immunodeficiency virus type 1)
Glaxosmithkline
LigandPNGBDBM9180((3R,3aS,6aR)-hexahydrofuro[2,3-b]furan-3-yl N-[(2S...)
Affinity DataKi: <0.00500nM IC50:  5nM. Assay description: The Ki values were determined using fluorogenic substrate, 2-(aminobenzoyl)-Thr-Ile-Nle-Phe(p-NO2)-Gln-ArgNH2. A standard curve relating changes in f...
In DepthDetails ArticlePubMed