BDBM91979 erk000047
SMILES CCNc1ncc(C)c(n1)-c1c[nH]c(c1)C(=O)NCc1ccccc1
InChI Key InChIKey=IYLAWFFOUBUTDF-UHFFFAOYSA-N
Data  2 KI
  Tab Delimited (TSV)   2D SDfile   Computed 3D by Vconf -m prep SDfile
Find this compound or compounds like it in BindingDB:
Activity Spreadsheet -- Enzyme Inhibition Constant Data from BindingDB
Found 2 hits for monomerid = 91979
TargetMitogen-activated protein kinase 1(Homo sapiens (Human))
Csar
LigandPNGBDBM91979(erk000047)
Affinity DataKi:  89nM. Assay description: Assay 1 ...
In DepthDetails PubMed
TargetMitogen-activated protein kinase 1(Homo sapiens (Human))
Csar
LigandPNGBDBM91979(erk000047)
Affinity DataKi:  89.1nM. Assay description: Photometric_Method2
In DepthDetails PubMed